{"text_format":"1","workbook":"xlsx","n_sheets":6,"sheets":["Bulk bene upload","工作表2","parameter","FAQ","County code","County code (2)"],"not_rendered":{"charts":0,"images":10,"macros":1,"external_links":1,"defined_names":258,"comments":2,"pivot_tables":0},"unopened":[],"bounds":{"document_bytes":16777216,"sheet_cells":100000,"rows_first":2000,"rows_last":500,"rows_between":2000,"halvings":0,"cell_chars":16384,"cell_head_chars":4096},"cells_cut":0,"cells_raw":0,"read":"whole","date_system":"1900"}

{"sheet":"Bulk bene upload","index":0,"n_rows":100,"n_cols":29,"rows_kept":100,"cut":false,"hidden":false,"merged":[[3,4,3,5],[3,0,3,3],[0,0,1,0],[2,0,2,7],[0,4,0,5]]}
["說明 (橘色為必填資訊) \nRemark (orange fields are mandatory)","付款人公司編號\nOrg ID","總筆數\nToal number of transaction"]
[null,"TWGTS",{"$f":"COUNTIF(A:A,\"Y\")","v":5}]
["上方  付款人資訊 (Above: Payer Information)      下方 受款人資訊 (Below: Beneficiary Information)"]
[null,null,null,null,"台幣付款必填(TWD Payment)"]
["\n資料欄位\nData","受款人銀行之國家\nBeneficiary country","受款人姓名\nBeneficiary name\n(請填真實姓名)","台幣/外幣付款\nTWD/ Foreign currency Payment","受款人銀行代碼\nBank code\n(國內受款帳號需填寫)","受款人分行代碼\nBranch code\n(國內受款帳號需填寫)","受款銀行代碼 Beneficiary ID\n台幣付款請填銀行代碼與分行代碼 (ex.星展銀行信義分行為8100179)\n外幣付款請填SWIFTBIC (ex. 中國信託三重分行為CTCBTWTP060)\nFill in bank code and branch code for TWD payment;\nFill in SWIFTBIC code for foreign currency payment","受款銀行帳號\nBank account number",null,"受款人暱稱\nBeneficiary nickname","受款人地址\nBeneficiary address","受款銀行帳號IBAN","轉送代碼\nRouting code","受款人種類\nPayee Category","受款銀行名稱\nBank Name","受款銀行地址\nBank address"]
["Y","INDIA","Chu LEE","外幣付款",null,null,"CITIINBXIBD","6817587527852",null,null,null,"123",45,"Others","Main India Banks","124 CONNAUGHT CIRCUS POINT BABA KHARAK SINGH MARG",null,null,null,null,null,null,null,null,null,{"$f":"IF(B6>0,VLOOKUP(B6,'County code'!A:B,2,FALSE),\" \")","v":"IND"},{"$f":"IF(D6>0,VLOOKUP(D6,'County code'!D:E,2,FALSE),\" \")","v":5},{"$f":"G6","v":"CITIINBXIBD"},{"$f":"IF(AA6=5,AB6,M6)","v":"CITIINBXIBD"}]
["Y","JAPAN","Chu LEE","外幣付款",null,null,"MHCBJPJTCLS","12345678912441",null,null,null,null,null,null,"MITUHO","日本 東京都千代田區大手町一丁目5番5號 大手町塔",null,null,null,null,null,null,null,null,null,{"$f":"IF(B7>0,VLOOKUP(B7,'County code'!A:B,2,FALSE),\" \")","v":"JPN"},{"$f":"IF(D7>0,VLOOKUP(D7,'County code'!D:E,2,FALSE),\" \")","v":5},{"$f":"G9","v":"CTCBTWTP901"},{"$f":"IF(AA7=5,AB7,M7)","v":"CTCBTWTP901"}]
["Y","TAIWAN_REGION","Chu LEE","台幣付款",null,null,8100179,"1234567891244",null,null,null,null,null,null,"DBS","玉山高峰",null,null,null,null,null,null,null,null,null,{"$f":"IF(B8>0,VLOOKUP(B8,'County code'!A:B,2,FALSE),\" \")","v":"TWN"},{"$f":"IF(D8>0,VLOOKUP(D8,'County code'!D:E,2,FALSE),\" \")","v":3},8100179,0]
["Y","TAIWAN_REGION","Chu LEE","外幣付款",null,null,"CTCBTWTP901","1234567891211",null,null,null,null,null,null,"DBS","low street",null,null,null,null,null,null,null,null,null,{"$f":"IF(B9>0,VLOOKUP(B9,'County code'!A:B,2,FALSE),\" \")","v":"TWN"},{"$f":"IF(D9>0,VLOOKUP(D9,'County code'!D:E,2,FALSE),\" \")","v":5},{"$f":"#REF!","v":{"$error":"#REF!"}},{"$error":"#REF!"}]
["Y","SINGAPORE","Chu LEE","外幣付款",null,null,"BOFASG3XJVC","1234567891244",null,null,null,null,null,null,"BANK OF AMERICA (SINGAPORE) LTD.",null,null,null,null,null,null,null,null,null,null,{"$f":"IF(B10>0,VLOOKUP(B10,'County code'!A:B,2,FALSE),\" \")","v":"SGP"},{"$f":"IF(D10>0,VLOOKUP(D10,'County code'!D:E,2,FALSE),\" \")","v":5},"BOFASG3XJVC","BOFASG3XJVC"]
[null,null,null,null,null,null,null,null,null,null,null,null,null,null,null,null,null,null,null,null,null,null,null,null,null,{"$f":"IF(B11>0,VLOOKUP(B11,'County code'!A:B,2,FALSE),\" \")","v":" "},{"$f":"IF(D11>0,VLOOKUP(D11,'County code'!D:E,2,FALSE),\" \")","v":" "},0,0]
[null,null,null,null,null,null,null,null,null,null,null,null,null,null,null,null,null,null,null,null,null,null,null,null,null,{"$f":"IF(B12>0,VLOOKUP(B12,'County code'!A:B,2,FALSE),\" \")","v":" "},{"$f":"IF(D12>0,VLOOKUP(D12,'County code'!D:E,2,FALSE),\" \")","v":" "},0,0]
[null,null,null,null,null,null,null,null,null,null,null,null,null,null,null,null,null,null,null,null,null,null,null,null,null,{"$f":"IF(B13>0,VLOOKUP(B13,'County code'!A:B,2,FALSE),\" \")","v":" "},{"$f":"IF(D13>0,VLOOKUP(D13,'County code'!D:E,2,FALSE),\" \")","v":" "},0,0]
[null,null,null,null,null,null,null,null,null,null,null,null,null,null,null,null,null,null,null,null,null,null,null,null,null,{"$f":"IF(B14>0,VLOOKUP(B14,'County code'!A:B,2,FALSE),\" \")","v":" "},{"$f":"IF(D14>0,VLOOKUP(D14,'County code'!D:E,2,FALSE),\" \")","v":" "},0,0]
[null,null,null,null,null,null,null,null,null,null,null,null,null,null,null,null,null,null,null,null,null,null,null,null,null,{"$f":"IF(B15>0,VLOOKUP(B15,'County code'!A:B,2,FALSE),\" \")","v":" "},{"$f":"IF(D15>0,VLOOKUP(D15,'County code'!D:E,2,FALSE),\" \")","v":" "},0,0]
[null,null,null,null,null,null,null,null,null,null,null,null,null,null,null,null,null,null,null,null,null,null,null,null,null,{"$f":"IF(B16>0,VLOOKUP(B16,'County code'!A:B,2,FALSE),\" \")","v":" "},{"$f":"IF(D16>0,VLOOKUP(D16,'County code'!D:E,2,FALSE),\" \")","v":" "},0,0]
[null,null,null,null,null,null,null,null,null,null,null,null,null,null,null,null,null,null,null,null,null,null,null,null,null,{"$f":"IF(B17>0,VLOOKUP(B17,'County code'!A:B,2,FALSE),\" \")","v":" "},{"$f":"IF(D17>0,VLOOKUP(D17,'County code'!D:E,2,FALSE),\" \")","v":" "},0,0]
[null,null,null,null,null,null,null,null,null,null,null,null,null,null,null,null,null,null,null,null,null,null,null,null,null,{"$f":"IF(B18>0,VLOOKUP(B18,'County code'!A:B,2,FALSE),\" \")","v":" "},{"$f":"IF(D18>0,VLOOKUP(D18,'County code'!D:E,2,FALSE),\" \")","v":" "},0,0]
[null,null,null,null,null,null,null,null,null,null,null,null,null,null,null,null,null,null,null,null,null,null,null,null,null,{"$f":"IF(B19>0,VLOOKUP(B19,'County code'!A:B,2,FALSE),\" \")","v":" "},{"$f":"IF(D19>0,VLOOKUP(D19,'County code'!D:E,2,FALSE),\" \")","v":" "},0,0]
[null,null,null,null,null,null,null,null,null,null,null,null,null,null,null,null,null,null,null,null,null,null,null,null,null,{"$f":"IF(B20>0,VLOOKUP(B20,'County code'!A:B,2,FALSE),\" \")","v":" "},{"$f":"IF(D20>0,VLOOKUP(D20,'County code'!D:E,2,FALSE),\" \")","v":" "},0,0]
[null,null,null,null,null,null,null,null,null,null,null,null,null,null,null,null,null,null,null,null,null,null,null,null,null,{"$f":"IF(B21>0,VLOOKUP(B21,'County code'!A:B,2,FALSE),\" \")","v":" "},{"$f":"IF(D21>0,VLOOKUP(D21,'County code'!D:E,2,FALSE),\" \")","v":" "},0,0]
[null,null,null,null,null,null,null,null,null,null,null,null,null,null,null,null,null,null,null,null,null,null,null,null,null,{"$f":"IF(B22>0,VLOOKUP(B22,'County code'!A:B,2,FALSE),\" \")","v":" "},{"$f":"IF(D22>0,VLOOKUP(D22,'County code'!D:E,2,FALSE),\" \")","v":" "},0,0]
[null,null,null,null,null,null,null,null,null,null,null,null,null,null,null,null,null,null,null,null,null,null,null,null,null,{"$f":"IF(B23>0,VLOOKUP(B23,'County code'!A:B,2,FALSE),\" \")","v":" "},{"$f":"IF(D23>0,VLOOKUP(D23,'County code'!D:E,2,FALSE),\" \")","v":" "},0,0]
[null,null,null,null,null,null,null,null,null,null,null,null,null,null,null,null,null,null,null,null,null,null,null,null,null,{"$f":"IF(B24>0,VLOOKUP(B24,'County code'!A:B,2,FALSE),\" \")","v":" "},{"$f":"IF(D24>0,VLOOKUP(D24,'County code'!D:E,2,FALSE),\" \")","v":" "},0,0]
[null,null,null,null,null,null,null,null,null,null,null,null,null,null,null,null,null,null,null,null,null,null,null,null,null,{"$f":"IF(B25>0,VLOOKUP(B25,'County code'!A:B,2,FALSE),\" \")","v":" "},{"$f":"IF(D25>0,VLOOKUP(D25,'County code'!D:E,2,FALSE),\" \")","v":" "},0,0]
[null,null,null,null,null,null,null,null,null,null,null,null,null,null,null,null,null,null,null,null,null,null,null,null,null,{"$f":"IF(B26>0,VLOOKUP(B26,'County code'!A:B,2,FALSE),\" \")","v":" "},{"$f":"IF(D26>0,VLOOKUP(D26,'County code'!D:E,2,FALSE),\" \")","v":" "},0,0]
[null,null,null,null,null,null,null,null,null,null,null,null,null,null,null,null,null,null,null,null,null,null,null,null,null,{"$f":"IF(B27>0,VLOOKUP(B27,'County code'!A:B,2,FALSE),\" \")","v":" "},{"$f":"IF(D27>0,VLOOKUP(D27,'County code'!D:E,2,FALSE),\" \")","v":" "},0,0]
[null,null,null,null,null,null,null,null,null,null,null,null,null,null,null,null,null,null,null,null,null,null,null,null,null,{"$f":"IF(B28>0,VLOOKUP(B28,'County code'!A:B,2,FALSE),\" \")","v":" "},{"$f":"IF(D28>0,VLOOKUP(D28,'County code'!D:E,2,FALSE),\" \")","v":" "},0,0]
[null,null,null,null,null,null,null,null,null,null,null,null,null,null,null,null,null,null,null,null,null,null,null,null,null,{"$f":"IF(B29>0,VLOOKUP(B29,'County code'!A:B,2,FALSE),\" \")","v":" "},{"$f":"IF(D29>0,VLOOKUP(D29,'County code'!D:E,2,FALSE),\" \")","v":" "},0,0]
[null,null,null,null,null,null,null,null,null,null,null,null,null,null,null,null,null,null,null,null,null,null,null,null,null,{"$f":"IF(B30>0,VLOOKUP(B30,'County code'!A:B,2,FALSE),\" \")","v":" "},{"$f":"IF(D30>0,VLOOKUP(D30,'County code'!D:E,2,FALSE),\" \")","v":" "},0,0]
[null,null,null,null,null,null,null,null,null,null,null,null,null,null,null,null,null,null,null,null,null,null,null,null,null,{"$f":"IF(B31>0,VLOOKUP(B31,'County code'!A:B,2,FALSE),\" \")","v":" "},{"$f":"IF(D31>0,VLOOKUP(D31,'County code'!D:E,2,FALSE),\" \")","v":" "},0,0]
[null,null,null,null,null,null,null,null,null,null,null,null,null,null,null,null,null,null,null,null,null,null,null,null,null,{"$f":"IF(B32>0,VLOOKUP(B32,'County code'!A:B,2,FALSE),\" \")","v":" "},{"$f":"IF(D32>0,VLOOKUP(D32,'County code'!D:E,2,FALSE),\" \")","v":" "},0,0]
[null,null,null,null,null,null,null,null,null,null,null,null,null,null,null,null,null,null,null,null,null,null,null,null,null,{"$f":"IF(B33>0,VLOOKUP(B33,'County code'!A:B,2,FALSE),\" \")","v":" "},{"$f":"IF(D33>0,VLOOKUP(D33,'County code'!D:E,2,FALSE),\" \")","v":" "},0,0]
[null,null,null,null,null,null,null,null,null,null,null,null,null,null,null,null,null,null,null,null,null,null,null,null,null,{"$f":"IF(B34>0,VLOOKUP(B34,'County code'!A:B,2,FALSE),\" \")","v":" "},{"$f":"IF(D34>0,VLOOKUP(D34,'County code'!D:E,2,FALSE),\" \")","v":" "},0,0]
[null,null,null,null,null,null,null,null,null,null,null,null,null,null,null,null,null,null,null,null,null,null,null,null,null,{"$f":"IF(B35>0,VLOOKUP(B35,'County code'!A:B,2,FALSE),\" \")","v":" "},{"$f":"IF(D35>0,VLOOKUP(D35,'County code'!D:E,2,FALSE),\" \")","v":" "},0,0]
[null,null,null,null,null,null,null,null,null,null,null,null,null,null,null,null,null,null,null,null,null,null,null,null,null,{"$f":"IF(B36>0,VLOOKUP(B36,'County code'!A:B,2,FALSE),\" \")","v":" "},{"$f":"IF(D36>0,VLOOKUP(D36,'County code'!D:E,2,FALSE),\" \")","v":" "},0,0]
[null,null,null,null,null,null,null,null,null,null,null,null,null,null,null,null,null,null,null,null,null,null,null,null,null,{"$f":"IF(B37>0,VLOOKUP(B37,'County code'!A:B,2,FALSE),\" \")","v":" "},{"$f":"IF(D37>0,VLOOKUP(D37,'County code'!D:E,2,FALSE),\" \")","v":" "},0,0]
[null,null,null,null,null,null,null,null,null,null,null,null,null,null,null,null,null,null,null,null,null,null,null,null,null,{"$f":"IF(B38>0,VLOOKUP(B38,'County code'!A:B,2,FALSE),\" \")","v":" "},{"$f":"IF(D38>0,VLOOKUP(D38,'County code'!D:E,2,FALSE),\" \")","v":" "},{"$f":"G38","v":0},0]
[null,null,null,null,null,null,null,null,null,null,null,null,null,null,null,null,null,null,null,null,null,null,null,null,null,{"$f":"IF(B39>0,VLOOKUP(B39,'County code'!A:B,2,FALSE),\" \")","v":" "},{"$f":"IF(D39>0,VLOOKUP(D39,'County code'!D:E,2,FALSE),\" \")","v":" "},0,0]
[null,null,null,null,null,null,null,null,null,null,null,null,null,null,null,null,null,null,null,null,null,null,null,null,null,{"$f":"IF(B40>0,VLOOKUP(B40,'County code'!A:B,2,FALSE),\" \")","v":" "},{"$f":"IF(D40>0,VLOOKUP(D40,'County code'!D:E,2,FALSE),\" \")","v":" "},0,0]
[null,null,null,null,null,null,null,null,null,null,null,null,null,null,null,null,null,null,null,null,null,null,null,null,null,{"$f":"IF(B41>0,VLOOKUP(B41,'County code'!A:B,2,FALSE),\" \")","v":" "},{"$f":"IF(D41>0,VLOOKUP(D41,'County code'!D:E,2,FALSE),\" \")","v":" "},0,0]
[null,null,null,null,null,null,null,null,null,null,null,null,null,null,null,null,null,null,null,null,null,null,null,null,null,{"$f":"IF(B42>0,VLOOKUP(B42,'County code'!A:B,2,FALSE),\" \")","v":" "},{"$f":"IF(D42>0,VLOOKUP(D42,'County code'!D:E,2,FALSE),\" \")","v":" "},0,0]
[null,null,null,null,null,null,null,null,null,null,null,null,null,null,null,null,null,null,null,null,null,null,null,null,null,{"$f":"IF(B43>0,VLOOKUP(B43,'County code'!A:B,2,FALSE),\" \")","v":" "},{"$f":"IF(D43>0,VLOOKUP(D43,'County code'!D:E,2,FALSE),\" \")","v":" "},0,0]
[null,null,null,null,null,null,null,null,null,null,null,null,null,null,null,null,null,null,null,null,null,null,null,null,null,{"$f":"IF(B44>0,VLOOKUP(B44,'County code'!A:B,2,FALSE),\" \")","v":" "},{"$f":"IF(D44>0,VLOOKUP(D44,'County code'!D:E,2,FALSE),\" \")","v":" "},0,0]
[null,null,null,null,null,null,null,null,null,null,null,null,null,null,null,null,null,null,null,null,null,null,null,null,null,{"$f":"IF(B45>0,VLOOKUP(B45,'County code'!A:B,2,FALSE),\" \")","v":" "},{"$f":"IF(D45>0,VLOOKUP(D45,'County code'!D:E,2,FALSE),\" \")","v":" "},0,0]
[null,null,null,null,null,null,null,null,null,null,null,null,null,null,null,null,null,null,null,null,null,null,null,null,null,{"$f":"IF(B46>0,VLOOKUP(B46,'County code'!A:B,2,FALSE),\" \")","v":" "},{"$f":"IF(D46>0,VLOOKUP(D46,'County code'!D:E,2,FALSE),\" \")","v":" "},0,0]
[null,null,null,null,null,null,null,null,null,null,null,null,null,null,null,null,null,null,null,null,null,null,null,null,null,{"$f":"IF(B47>0,VLOOKUP(B47,'County code'!A:B,2,FALSE),\" \")","v":" "},{"$f":"IF(D47>0,VLOOKUP(D47,'County code'!D:E,2,FALSE),\" \")","v":" "},0,0]
[null,null,null,null,null,null,null,null,null,null,null,null,null,null,null,null,null,null,null,null,null,null,null,null,null,{"$f":"IF(B48>0,VLOOKUP(B48,'County code'!A:B,2,FALSE),\" \")","v":" "},{"$f":"IF(D48>0,VLOOKUP(D48,'County code'!D:E,2,FALSE),\" \")","v":" "},0,0]
[null,null,null,null,null,null,null,null,null,null,null,null,null,null,null,null,null,null,null,null,null,null,null,null,null,{"$f":"IF(B49>0,VLOOKUP(B49,'County code'!A:B,2,FALSE),\" \")","v":" "},{"$f":"IF(D49>0,VLOOKUP(D49,'County code'!D:E,2,FALSE),\" \")","v":" "},0,0]
[null,null,null,null,null,null,null,null,null,null,null,null,null,null,null,null,null,null,null,null,null,null,null,null,null,{"$f":"IF(B50>0,VLOOKUP(B50,'County code'!A:B,2,FALSE),\" \")","v":" "},{"$f":"IF(D50>0,VLOOKUP(D50,'County code'!D:E,2,FALSE),\" \")","v":" "},0,0]
[null,null,null,null,null,null,null,null,null,null,null,null,null,null,null,null,null,null,null,null,null,null,null,null,null,{"$f":"IF(B51>0,VLOOKUP(B51,'County code'!A:B,2,FALSE),\" \")","v":" "},{"$f":"IF(D51>0,VLOOKUP(D51,'County code'!D:E,2,FALSE),\" \")","v":" "},0,0]
[null,null,null,null,null,null,null,null,null,null,null,null,null,null,null,null,null,null,null,null,null,null,null,null,null,{"$f":"IF(B52>0,VLOOKUP(B52,'County code'!A:B,2,FALSE),\" \")","v":" "},{"$f":"IF(D52>0,VLOOKUP(D52,'County code'!D:E,2,FALSE),\" \")","v":" "},0,0]
[null,null,null,null,null,null,null,null,null,null,null,null,null,null,null,null,null,null,null,null,null,null,null,null,null,{"$f":"IF(B53>0,VLOOKUP(B53,'County code'!A:B,2,FALSE),\" \")","v":" "},{"$f":"IF(D53>0,VLOOKUP(D53,'County code'!D:E,2,FALSE),\" \")","v":" "},0,0]
[null,null,null,null,null,null,null,null,null,null,null,null,null,null,null,null,null,null,null,null,null,null,null,null,null,{"$f":"IF(B54>0,VLOOKUP(B54,'County code'!A:B,2,FALSE),\" \")","v":" "},{"$f":"IF(D54>0,VLOOKUP(D54,'County code'!D:E,2,FALSE),\" \")","v":" "},0,0]
[null,null,null,null,null,null,null,null,null,null,null,null,null,null,null,null,null,null,null,null,null,null,null,null,null,{"$f":"IF(B55>0,VLOOKUP(B55,'County code'!A:B,2,FALSE),\" \")","v":" "},{"$f":"IF(D55>0,VLOOKUP(D55,'County code'!D:E,2,FALSE),\" \")","v":" "},0,0]
[null,null,null,null,null,null,null,null,null,null,null,null,null,null,null,null,null,null,null,null,null,null,null,null,null,{"$f":"IF(B56>0,VLOOKUP(B56,'County code'!A:B,2,FALSE),\" \")","v":" "},{"$f":"IF(D56>0,VLOOKUP(D56,'County code'!D:E,2,FALSE),\" \")","v":" "},0,0]
[null,null,null,null,null,null,null,null,null,null,null,null,null,null,null,null,null,null,null,null,null,null,null,null,null,{"$f":"IF(B57>0,VLOOKUP(B57,'County code'!A:B,2,FALSE),\" \")","v":" "},{"$f":"IF(D57>0,VLOOKUP(D57,'County code'!D:E,2,FALSE),\" \")","v":" "},0,0]
[null,null,null,null,null,null,null,null,null,null,null,null,null,null,null,null,null,null,null,null,null,null,null,null,null,{"$f":"IF(B58>0,VLOOKUP(B58,'County code'!A:B,2,FALSE),\" \")","v":" "},{"$f":"IF(D58>0,VLOOKUP(D58,'County code'!D:E,2,FALSE),\" \")","v":" "},0,0]
[null,null,null,null,null,null,null,null,null,null,null,null,null,null,null,null,null,null,null,null,null,null,null,null,null,{"$f":"IF(B59>0,VLOOKUP(B59,'County code'!A:B,2,FALSE),\" \")","v":" "},{"$f":"IF(D59>0,VLOOKUP(D59,'County code'!D:E,2,FALSE),\" \")","v":" "},0,0]
[null,null,null,null,null,null,null,null,null,null,null,null,null,null,null,null,null,null,null,null,null,null,null,null,null,{"$f":"IF(B60>0,VLOOKUP(B60,'County code'!A:B,2,FALSE),\" \")","v":" "},{"$f":"IF(D60>0,VLOOKUP(D60,'County code'!D:E,2,FALSE),\" \")","v":" "},0,0]
{"$rows_left_out":41}
{"sheet":"工作表2","index":1,"n_rows":6,"n_cols":16,"rows_kept":6,"cut":false,"hidden":true,"merged":[]}
[]
[]
[]
[null,null,null,null,null,null,null,null,null,null,null,null,null,null,null,"防呆: 選非台灣的國家就不能選台幣付款"]
[null,null,null,null,null,null,null,null,null,null,null,null,null,null,null,"驗證: 選擇國內付款 就不用填國外付款的項目"]
[null,null,null,null,null,null,null,null,null,null,null,null,null,null,null,"受款人銀行國家需要對應到country code"]

{"sheet":"parameter","index":2,"n_rows":24,"n_cols":7,"rows_kept":24,"cut":false,"hidden":false,"merged":[]}
["參數_header","H"]
["參數_Affiliate","DBSTW"]
["Org ID",{"$f":"'Bulk bene upload'!B2","v":"TWGTS"}]
["Payee Bene Country","TWN"]
["Action Identifier","A",null,null,null,"受款人種類\nPayee Category","Entry indicator"]
["Entry indicator","A",null,null,null,null,"A"]
["Printed name for DD / Cheque",null,null,null,null,"Other","P"]
["DDA Reference",null,null,null,null,"Create","I"]
["Proxy type",null,null,null,null,"Modify"]
[null,null,null,null,null,"Delete"]
[]
["參數_表尾","T"]
["分隔符號","|"]
["今日",{"$f":"NOW()","v":"2022-05-10T10:58:06.930"},{"$f":"TEXT(TODAY(),\"yyyymmdd\")","v":"20220510"},{"$f":"CONCATENATE(TEXT(TODAY(),),TEXT(NOW(),\"HHMMSS\"))","v":"105807"}]
[]
["表頭",{"$f":"CONCATENATE(B1,B13,TEXT(TODAY(),\"yyymmdd\"),B13,D14)","v":"H|20220510|105807"}]
["表資料",{"$f":"CONCATENATE(B5,B13,B2,B13,B3)","v":"A|DBSTW|TWGTS"}]
["表尾",{"$f":"CONCATENATE(B12,B13,'Bulk bene upload'!C2)","v":"T|5"}]
["最大處理筆數",1000]
["暫存"]
["亂數",{"$f":"INT(RAND()*99999)","v":92681}]
[]
[]
["Payment options",0]

{"sheet":"FAQ","index":3,"n_rows":6,"n_cols":2,"rows_kept":6,"cut":false,"hidden":false,"merged":[]}
["受款人批次上傳操作步驟"]
[1,"登入DBS IDEAL進入首頁"]
[2,"點擊左側選單列的【付款及轉帳】,點選【受款人】"]
[3,"點選【上傳多筆受款人資料】"]
[4,"將您的txt檔案拖曳至灰底區域上傳檔案, 上傳後會出現檔案名稱, 確認後點選【確認上傳】"]
[5,"系統將會告知您上傳檔案正在處理中, 點選【我知道了】 之後即可在下方處確認檔案上傳狀態"]

{"sheet":"County code","index":4,"n_rows":252,"n_cols":5,"rows_kept":252,"cut":false,"hidden":true,"merged":[]}
["Description","Country_Code",null,"Currency","No"]
["UNITED_STATES","USA",null,"台幣付款",3]
["CANADA","CAN",null,"外幣付款",5]
["AFGHANISTAN","AFG"]
["ALBANIA","ALB"]
["ALGERIA","DZA"]
["AMERICAN_SAMOA","ASM"]
["ANDORRA","AND"]
["ANGOLA","AGO"]
["ANGUILLA","AIA"]
["ANTARCTICA","ATA"]
["ANTIGUA_AND_BARBUDA","ATG"]
["ARGENTINA","ARG"]
["ARMENIA","ARM"]
["ARUBA","ABW"]
["AUSTRALIA","AUS"]
["AUSTRIA","AUT"]
["AZERBAIJAN","AZE"]
["BAHAMAS","BHS"]
["BAHRAIN","BHR"]
["BANGLADESH","BGD"]
["BARBADOS","BRB"]
["BELARUS","BLR"]
["BELGIUM","BEL"]
["BELIZE","BLZ"]
["BENIN","BEN"]
["BERMUDA","BMU"]
["BHUTAN","BTN"]
["Bolivia__Plurinational_State_Of","BOL"]
["BOSNIA_AND_HERZEGOVINA","BIH"]
["BOTSWANA","BWA"]
["BOUVET_ISLAND","BVT"]
["BRAZIL","BRA"]
["BRITISH_INDIAN_OCEAN_TERRITORY","IOT"]
["BRUNEI_DARUSSALAM","BRN"]
["BULGARIA","BGR"]
["BURKINA_FASO","BFA"]
["BURUNDI","BDI"]
["CAMBODIA","KHM"]
["CAMEROON","CMR"]
["CAPE_VERDE","CPV"]
["CAYMAN_ISLANDS","CYM"]
["CENTRAL_AFRICAN_REPUBLIC","CAF"]
["CHAD","TCD"]
["CHILE","CHL"]
["CHINA","CHN"]
["CHRISTMAS_ISLAND","CXR"]
["COCOS(KEELING)_ISLANDS","CCK"]
["COLOMBIA","COL"]
["COMOROS","COM"]
["CONGO","COG"]
["REPUBLIC_OF_CONGO","COO"]
["COOK_ISLANDS","COK"]
["COSTA_RICA","CRI"]
["COTE_D'IVOIRE","CIV"]
["CROATIA","HRV"]
["CUBA","CUB"]
["CYPRUS","CYP"]
["CZECH_REPUBLIC","CZE"]
["DENMARK","DNK"]
{"$rows_left_out":193}
{"sheet":"County code (2)","index":5,"n_rows":252,"n_cols":3,"rows_kept":252,"cut":false,"hidden":true,"merged":[]}
["Description","Currency1","Currency2"]
[{"$f":"'County code'!$A2","v":"UNITED_STATES"},{"$f":"'County code'!$D$3","v":"外幣付款"}]
[{"$f":"'County code'!$A3","v":"CANADA"},{"$f":"'County code'!$D$3","v":"外幣付款"}]
[{"$f":"'County code'!$A4","v":"AFGHANISTAN"},{"$f":"'County code'!$D$3","v":"外幣付款"}]
[{"$f":"'County code'!$A5","v":"ALBANIA"},{"$f":"'County code'!$D$3","v":"外幣付款"}]
[{"$f":"'County code'!$A6","v":"ALGERIA"},{"$f":"'County code'!$D$3","v":"外幣付款"}]
[{"$f":"'County code'!$A7","v":"AMERICAN_SAMOA"},{"$f":"'County code'!$D$3","v":"外幣付款"}]
[{"$f":"'County code'!$A8","v":"ANDORRA"},{"$f":"'County code'!$D$3","v":"外幣付款"}]
[{"$f":"'County code'!$A9","v":"ANGOLA"},{"$f":"'County code'!$D$3","v":"外幣付款"}]
[{"$f":"'County code'!$A10","v":"ANGUILLA"},{"$f":"'County code'!$D$3","v":"外幣付款"}]
[{"$f":"'County code'!$A11","v":"ANTARCTICA"},{"$f":"'County code'!$D$3","v":"外幣付款"}]
[{"$f":"'County code'!$A12","v":"ANTIGUA_AND_BARBUDA"},{"$f":"'County code'!$D$3","v":"外幣付款"}]
[{"$f":"'County code'!$A13","v":"ARGENTINA"},{"$f":"'County code'!$D$3","v":"外幣付款"}]
[{"$f":"'County code'!$A14","v":"ARMENIA"},{"$f":"'County code'!$D$3","v":"外幣付款"}]
[{"$f":"'County code'!$A15","v":"ARUBA"},{"$f":"'County code'!$D$3","v":"外幣付款"}]
[{"$f":"'County code'!$A16","v":"AUSTRALIA"},{"$f":"'County code'!$D$3","v":"外幣付款"}]
[{"$f":"'County code'!$A17","v":"AUSTRIA"},{"$f":"'County code'!$D$3","v":"外幣付款"}]
[{"$f":"'County code'!$A18","v":"AZERBAIJAN"},{"$f":"'County code'!$D$3","v":"外幣付款"}]
[{"$f":"'County code'!$A19","v":"BAHAMAS"},{"$f":"'County code'!$D$3","v":"外幣付款"}]
[{"$f":"'County code'!$A20","v":"BAHRAIN"},{"$f":"'County code'!$D$3","v":"外幣付款"}]
[{"$f":"'County code'!$A21","v":"BANGLADESH"},{"$f":"'County code'!$D$3","v":"外幣付款"}]
[{"$f":"'County code'!$A22","v":"BARBADOS"},{"$f":"'County code'!$D$3","v":"外幣付款"}]
[{"$f":"'County code'!$A23","v":"BELARUS"},{"$f":"'County code'!$D$3","v":"外幣付款"}]
[{"$f":"'County code'!$A24","v":"BELGIUM"},{"$f":"'County code'!$D$3","v":"外幣付款"}]
[{"$f":"'County code'!$A25","v":"BELIZE"},{"$f":"'County code'!$D$3","v":"外幣付款"}]
[{"$f":"'County code'!$A26","v":"BENIN"},{"$f":"'County code'!$D$3","v":"外幣付款"}]
[{"$f":"'County code'!$A27","v":"BERMUDA"},{"$f":"'County code'!$D$3","v":"外幣付款"}]
[{"$f":"'County code'!$A28","v":"BHUTAN"},{"$f":"'County code'!$D$3","v":"外幣付款"}]
[{"$f":"'County code'!$A29","v":"Bolivia__Plurinational_State_Of"},{"$f":"'County code'!$D$3","v":"外幣付款"}]
[{"$f":"'County code'!$A30","v":"BOSNIA_AND_HERZEGOVINA"},{"$f":"'County code'!$D$3","v":"外幣付款"}]
[{"$f":"'County code'!$A31","v":"BOTSWANA"},{"$f":"'County code'!$D$3","v":"外幣付款"}]
[{"$f":"'County code'!$A32","v":"BOUVET_ISLAND"},{"$f":"'County code'!$D$3","v":"外幣付款"}]
[{"$f":"'County code'!$A33","v":"BRAZIL"},{"$f":"'County code'!$D$3","v":"外幣付款"}]
[{"$f":"'County code'!$A34","v":"BRITISH_INDIAN_OCEAN_TERRITORY"},{"$f":"'County code'!$D$3","v":"外幣付款"}]
[{"$f":"'County code'!$A35","v":"BRUNEI_DARUSSALAM"},{"$f":"'County code'!$D$3","v":"外幣付款"}]
[{"$f":"'County code'!$A36","v":"BULGARIA"},{"$f":"'County code'!$D$3","v":"外幣付款"}]
[{"$f":"'County code'!$A37","v":"BURKINA_FASO"},{"$f":"'County code'!$D$3","v":"外幣付款"}]
[{"$f":"'County code'!$A38","v":"BURUNDI"},{"$f":"'County code'!$D$3","v":"外幣付款"}]
[{"$f":"'County code'!$A39","v":"CAMBODIA"},{"$f":"'County code'!$D$3","v":"外幣付款"}]
[{"$f":"'County code'!$A40","v":"CAMEROON"},{"$f":"'County code'!$D$3","v":"外幣付款"}]
[{"$f":"'County code'!$A41","v":"CAPE_VERDE"},{"$f":"'County code'!$D$3","v":"外幣付款"}]
[{"$f":"'County code'!$A42","v":"CAYMAN_ISLANDS"},{"$f":"'County code'!$D$3","v":"外幣付款"}]
[{"$f":"'County code'!$A43","v":"CENTRAL_AFRICAN_REPUBLIC"},{"$f":"'County code'!$D$3","v":"外幣付款"}]
[{"$f":"'County code'!$A44","v":"CHAD"},{"$f":"'County code'!$D$3","v":"外幣付款"}]
[{"$f":"'County code'!$A45","v":"CHILE"},{"$f":"'County code'!$D$3","v":"外幣付款"}]
[{"$f":"'County code'!$A46","v":"CHINA"},{"$f":"'County code'!$D$3","v":"外幣付款"}]
[{"$f":"'County code'!$A47","v":"CHRISTMAS_ISLAND"},{"$f":"'County code'!$D$3","v":"外幣付款"}]
[{"$f":"'County code'!$A48","v":"COCOS(KEELING)_ISLANDS"},{"$f":"'County code'!$D$3","v":"外幣付款"}]
[{"$f":"'County code'!$A49","v":"COLOMBIA"},{"$f":"'County code'!$D$3","v":"外幣付款"}]
[{"$f":"'County code'!$A50","v":"COMOROS"},{"$f":"'County code'!$D$3","v":"外幣付款"}]
[{"$f":"'County code'!$A51","v":"CONGO"},{"$f":"'County code'!$D$3","v":"外幣付款"}]
[{"$f":"'County code'!$A52","v":"REPUBLIC_OF_CONGO"},{"$f":"'County code'!$D$3","v":"外幣付款"}]
[{"$f":"'County code'!$A53","v":"COOK_ISLANDS"},{"$f":"'County code'!$D$3","v":"外幣付款"}]
[{"$f":"'County code'!$A54","v":"COSTA_RICA"},{"$f":"'County code'!$D$3","v":"外幣付款"}]
[{"$f":"'County code'!$A55","v":"COTE_D'IVOIRE"},{"$f":"'County code'!$D$3","v":"外幣付款"}]
[{"$f":"'County code'!$A56","v":"CROATIA"},{"$f":"'County code'!$D$3","v":"外幣付款"}]
[{"$f":"'County code'!$A57","v":"CUBA"},{"$f":"'County code'!$D$3","v":"外幣付款"}]
[{"$f":"'County code'!$A58","v":"CYPRUS"},{"$f":"'County code'!$D$3","v":"外幣付款"}]
[{"$f":"'County code'!$A59","v":"CZECH_REPUBLIC"},{"$f":"'County code'!$D$3","v":"外幣付款"}]
[{"$f":"'County code'!$A60","v":"DENMARK"},{"$f":"'County code'!$D$3","v":"外幣付款"}]
{"$rows_left_out":192}